humidité d'un certain volume de sol
type: Concept
subject: Pedology @en
subject: Pédologie
definition: Quantité d'eau, exprimée sous la forme d'une proportion pondérale ou volumique, présente à un moment donné dans un certain volume de sol. (Source : INRA)
in scheme: PLP
note: Cette quantité est le plus souvent déterminée ex situ sur échantillons sortis de leur contexte pédologique initial, mais il existe des méthodes de mesure et de suivi in situ (par exemple, l'humidimétrie neutronique ou la TDR). (Source : INRA)
preferred label: soil moisture @en
related: http://opendata.inrae.fr/PLP/344
related: http://opendata.inrae.fr/PLP/486
top concept of: PLP

RDF description of
primary topic: humidité d'un certain volume de sol