humidités caractéristiques
type: Concept
subject: Pedology @en
subject: Pédologie
definition: Humidités déterminées sous certaines contraintes ou sous certaines conditions expérimentales sur des échantillons de sols pour caractériser les propriétés de rétention de tel ou tel horizon. (Source : INRA)
in scheme: PLP
note: Exemples : humidité à la capacité au champ, humidité au point de flétrissement, humidité équivalente, humidité résiduelle. (Source : INRA)
preferred label: characteristic water contents @en
related: http://opendata.inrae.fr/PLP/151
related: http://opendata.inrae.fr/PLP/759
related: http://opendata.inrae.fr/PLP/490
related: http://opendata.inrae.fr/PLP/485
related: http://opendata.inrae.fr/PLP/488
related: http://opendata.inrae.fr/PLP/489
related: http://opendata.inrae.fr/PLP/487
related: http://opendata.inrae.fr/PLP/732
top concept of: PLP

RDF description of
primary topic: humidités caractéristiques