humus-bearing
type: Concept
subject: Pedology
subject: Pédologie @fr
alternative label: humus-rich
alternative label: humiferous
definition: Qui contient des matières organiques humifiées. (Source : INRA) @fr
in scheme: PLP
note: Dans le référentiel Pédologique 2007, qualifie un horizon ou un matériau qui contient beaucoup plus de carbone organique que la "norme" de l'horizon s'il en existe. (Source : INRA) @fr
preferred label: humifère @fr
related: http://opendata.inrae.fr/PLP/331
related: http://opendata.inrae.fr/PLP/494
top concept of: PLP

RDF description of
primary topic: humus-bearing