humification
type: Concept
subject: Pedology @en
subject: Agronomie
subject: Pédologie
subject: Agronomy @en
definition: Ensemble des processus biochimiques, intervenant dans les horizons de surface, qui décomposent les matières organiques fraîches, puis contribuent à la synhèse de substances humiques. (Source : INRA)
in scheme: PLP
related: http://opendata.inrae.fr/PLP/495
related: http://opendata.inrae.fr/PLP/17
top concept of: PLP

RDF description of
primary topic: humification