amendement (substance)
type: Concept
subject: Agronomie
subject: Agronomy @en
definition: Substance épandue sur une parcelle agricole pour améliorer les propriétés physiques ou physico-chimiques du sol (fumier, chaux, etc.). (Source : INRA)
in scheme: PLP
preferred label: soil amendment @en
related: http://opendata.inrae.fr/PLP/174
top concept of: PLP

RDF description of
primary topic: amendement (substance)