accumulation
type: Concept
subject: Pedology @en
subject: Pédologie
definition: Augmentation dans un horizon de la proportion d'un constituant quelconque (argiles, matières organiques, calcaire, silice, fer, sels, etc.). (Source : INRA)
in scheme: PLP
note: On doit distinguer l'accumulation relative : le constituant s'accumule suite au départ d'autres substances et l'accumulation absolue : le constituant s'immobilise après transfert latéral ou vertical en provenance d'autres horizons ou d'une source extérieure. (Source : INRA)
related: http://opendata.inrae.fr/PLP/254
related: http://opendata.inrae.fr/PLP/462
related: http://opendata.inrae.fr/PLP/324
related: http://opendata.inrae.fr/PLP/475
related: http://opendata.inrae.fr/PLP/288
related: http://opendata.inrae.fr/PLP/328
related: http://opendata.inrae.fr/PLP/459
related: http://opendata.inrae.fr/PLP/767
top concept of: PLP

RDF description of
primary topic: accumulation