hydromors
type: Concept
subject: Pedology @en
subject: Pédologie
definition: Formes d'humus de milieux très acides affectées par des engorgements par nappes fluctuantes proches de la surface pouvant disparaître pendant deux ou trois mois. (Source : INRA)
in scheme: PLP
related: http://opendata.inrae.fr/PLP/627
related: http://opendata.inrae.fr/PLP/445
related: http://opendata.inrae.fr/PLP/388
top concept of: PLP

RDF description of
primary topic: hydromors