RDF description of
primary topic: hydromulls

hydromulls
type: Concept
subject: Pedology @en
subject: Pédologie
definition: Formes d'humus montrant la succession d'horizons OL (litière) par dessus des horizons A grumeleux et présentant des taches rouille liées à des excès d'eau. (Source : INRA)
in scheme: PLP
note: Les hydromulls se forment sous l'influence de la frange capillaire d'une nappe. (Source : INRA)
related: http://opendata.inrae.fr/PLP/388
related: http://opendata.inrae.fr/PLP/634
top concept of: PLP