RDF description of
primary topic: hypermagnésique

hypermagnésique
type: Concept
subject: Pedology @en
subject: Pédologie
definition: Qualifie un horizon ou un solum dont le complexe adsorbant est saturé à plus de 80 % et dans lequel le rapport Ca2+ / Mg2+ est inférieur à 0,2 (Référentiel Pédologique). (Source : INRA)
in scheme: PLP
preferred label: hypermagnesic @en
top concept of: PLP