illites
type: Concept
subject: Mineralogy @en
subject: Pedology @en
subject: Minéralogie
subject: Pédologie
definition: Famille de minéraux argileux 2/1 dioctaédriques et potassiques dont l'écartement des feuillets à 10 angströms est fixe. (Source : INRA)
in scheme: PLP
note: Minéraux peu gonflants, à capacité d'échange modérée, les illites se présentent sous la forme de particules polycristallines résultant de l'assemblage de plusieurs cristallites élémentaires, de forme le plus souvent lenticulaire. En fait, les édifices illitiques des sols sont toujours une association de divers minéraux micacés de petite taille pouvant avoir des compositions diverses et plusieurs origines. (Source : INRA)
related: http://opendata.inrae.fr/PLP/605
related: http://opendata.inrae.fr/PLP/615
related: http://opendata.inrae.fr/PLP/74
related: http://opendata.inrae.fr/PLP/79
top concept of: PLP

RDF description of
primary topic: illites