illuviation
type: Concept
subject: Pedology
subject: Pédologie @fr
alternative label: translocation
definition: Apport de matières fines dans un horizon ou tout autre volume pédologique, provenant d'autres horizons situés au-dessus au sein d'un même solum (illuviation verticale) ou plus haut sur le versant (illuviation latérale ou oblique). (Source : INRA) @fr
in scheme: PLP
note: Cet apport peut résulter de processus de transfert de particules, ou par précipitation. Comme il s'agit d'un transfert au sein d'une couverture pédologique, l'illuviation à un endroit résulte toujours d'une éluviation à un autre endroit. (Source : INRA) @fr
related: http://opendata.inrae.fr/PLP/979
related: http://opendata.inrae.fr/PLP/82
related: http://opendata.inrae.fr/PLP/815
related: http://opendata.inrae.fr/PLP/506
related: http://opendata.inrae.fr/PLP/576
related: http://opendata.inrae.fr/PLP/521
related: http://opendata.inrae.fr/PLP/322
related: http://opendata.inrae.fr/PLP/179
related: http://opendata.inrae.fr/PLP/459
related: http://opendata.inrae.fr/PLP/207
top concept of: PLP

RDF description of
primary topic: illuviation