imbibition
type: Concept
subject: Pedology
subject: Pédologie @fr
alternative label: soaking
definition: Type particulier de saturation d'un horizon par l'eau en l'absence de pores grossiers, dans lequel l'eau est alors fortement liée à la phase solide par des forces capillaires et demeure très peu mobile. (Source : INRA) @fr
in scheme: PLP
related: http://opendata.inrae.fr/PLP/836
related: http://opendata.inrae.fr/PLP/295
related: http://opendata.inrae.fr/PLP/640
related: http://opendata.inrae.fr/PLP/786
top concept of: PLP

RDF description of
primary topic: imbibition