RDF description of
primary topic: immobilisation

immobilisation
type: Concept
subject: Pedology
subject: Pédologie @fr
definition: Phénomène réversible de passage de substances ou de particules du sol d'une forme mobile à une forme immobile. (Source : INRA) @fr
in scheme: PLP
related: http://opendata.inrae.fr/PLP/19
related: http://opendata.inrae.fr/PLP/376
related: http://opendata.inrae.fr/PLP/90
top concept of: PLP