imogolite
type: Concept
subject: Pedology @en
subject: Pédologie
definition: Aluminosilicate hydraté à organisation cristalline, mais non décelable par diffractométrie X, se présentant dans les sols sous la forme de très fins filaments entremêlés (diamètre de l'ordre de 20 angströms, soit 2 nanomètres). (Source : INRA)
in scheme: PLP
note: Il s'agit d'un minéral de néoformation associé aux allophanes dans les silandosols et présent également dans les horizons podzoliques BP des podzosols. (Source : INRA)
related: http://opendata.inrae.fr/PLP/731
related: http://opendata.inrae.fr/PLP/854
related: http://opendata.inrae.fr/PLP/38
top concept of: PLP

RDF description of
primary topic: imogolite