RDF description of
primary topic: indice COLE

indice COLE
type: Concept
subject: Pedology @en
subject: Pédologie
alternative label: COLE @en
definition: Mesure linéaire du potentiel de gonflement/rétraction d'un horizon. (Source : INRA)
in scheme: PLP
note: Le COLE est défini comme (Lh/Ls) - 1 dans lequel Lh est la longueur d'un agrégat humide à la capacité au champ (environ 33 kPa) et Ls sa longueur à sec (séché à 105 °C). (Source : INRA)
preferred label: coefficient of linear extensibility @en
related: http://opendata.inrae.fr/PLP/813
top concept of: PLP