RDF description of
primary topic: indice d'eau

indice d'eau
type: Concept
subject: Pedology @en
subject: Pédologie
definition: Expression de la capacité de rétention en eau d'un échantillon de sol non perturbé sous une forme volumique. (Source : INRA)
in scheme: PLP
note: Le volume d'eau est exprimé par rapport au volume de solide qui reste constant quel que soit l'état hydrique de l'échantillon (Ve/Vs). (Source : INRA)
preferred label: water ratio @en
related: http://opendata.inrae.fr/PLP/759
related: http://opendata.inrae.fr/PLP/520
related: http://opendata.inrae.fr/PLP/226
top concept of: PLP