indice d'instabilité structurale
type: Concept
subject: Pedology @en
subject: Pédologie
alternative label: Is
definition: Indice combinant les résultats de tests de stabilité structurale en une seule valeur numérique. (Source : INRA)
in scheme: PLP
note: Les valeurs obtenues expérimentalement variaient de 0,1 pour des échantillons de terres calcaires humifères à plus de 100 pour des échantillons de sols sodiques très instables. Il s'agit donc bien d'un indice d'instabilité. Il a été convenu d'utiliser le logarithme décimal de Is x 10, soit log 10 Is qui s'échelonne donc, en général, de 1 à 3. (Source : INRA)
preferred label: structure instability index @en
related: http://opendata.inrae.fr/PLP/963
related: http://opendata.inrae.fr/PLP/964
top concept of: PLP

RDF description of
primary topic: indice d'instabilité structurale