RDF description of
primary topic: indice de plasticité

indice de plasticité
type: Concept
subject: Pedology @en
subject: Pédologie
definition: Gamme des teneurs en eau situées entre la limite de liquidité et la limite de plasticité, pour laquelle l'échantillon de sol montre un comportement plastique. (Source : INRA)
in scheme: PLP
preferred label: plasticity index @en
related: http://opendata.inrae.fr/PLP/550
related: http://opendata.inrae.fr/PLP/552
top concept of: PLP