indice pyrophosphate
type: Concept
subject: Pedology @en
subject: Pédologie
definition: Indice servant à mesurer le degré de décomposition du matériel végétal par extraction des composants organiques solubles dans le pyrophosphate de sodium. (Source : INRA)
in scheme: PLP
note: Détermination spécifique à l'étude des horizons histiques. (Source : INRA)
preferred label: pyrophosphate index @en
related: http://opendata.inrae.fr/PLP/470
top concept of: PLP

RDF description of
primary topic: indice pyrophosphate