RDF description of
primary topic: infiltration

infiltration
type: Concept
subject: Pedology @en
subject: Pédologie
definition: Pénétration de l'eau dans un sol à partir de sa surface. (Source : INRA)
in scheme: PLP
note: La capacité instantanée d'infiltration d'un horizon de surface peut être inférieure au débit d'eau apporté par une averse, d'où la formation de flaques en surface pouvant mener à un processus de ruissellement. Dans un tel cas, deux causes (non exclusives) peuvent être invoquées : des précipitations trop importantes ou la surface du sol fermée par une croûte de battance. (Source : INRA)
related: http://opendata.inrae.fr/PLP/231
related: http://opendata.inrae.fr/PLP/696
related: http://opendata.inrae.fr/PLP/822
top concept of: PLP