RDF description of
primary topic: insaturé

insaturé
type: Concept
subject: Pedology @en
subject: Pédologie
definition: Qualifie un horizon ou un solum dont le taux de saturation du complexe adsorbant est inférieur à 80 % (Référentiel Pédologique). (Source : INRA)
in scheme: PLP
preferred label: unsaturated @en
related: http://opendata.inrae.fr/PLP/270
related: http://opendata.inrae.fr/PLP/600
related: http://opendata.inrae.fr/PLP/657
top concept of: PLP