interdigitations
type: Concept
subject: Pedology @en
subject: Pédologie
definition: Pénétrations d'un horizon E dans un horizon BT (ou S) sous-jacent le long des faces des unités structurales, essentiellement verticales. (Source : INRA)
in scheme: PLP
note: Ces pénétrations ne sont pas assez larges pour constituer des langues, mais forment des squelettanes continus (concentrations relatives de sables et/ou limons, après départ ou destruction des particules argileuses). (Source : INRA)
preferred label: interfingering @en
related: http://opendata.inrae.fr/PLP/261
related: http://opendata.inrae.fr/PLP/898
related: http://opendata.inrae.fr/PLP/414
top concept of: PLP

RDF description of
primary topic: interdigitations