intergrade
type: Concept
subject: Pedology @en
subject: Pédologie
definition: Qualifie un solum ou une catégorie typologique intermédiaire entre deux catégoriers de classification de même niveau hiérarchique. (Source : INRA)
in scheme: PLP
note: Des horizons présentant des caractères additionnels les rendant intermédiaires entre deux grands types d'horizons sont dits intergrades. Par exemple un horizon Sv est un horizon structural présentant quelques caractères vertiques et un horizon Ck un horizon C présentant des traits peu abondants d'accumulation de calcaire secondaire. En minéralogie, on qualifie parfois d'intergrades des minéraux argileux résultant de transformations progressives à partir d'illites ou de micas et possédant des propriétés d'hydratation et de gonflement intermédiaires entre vermiculites et smectites. (Source : INRA)
related: http://opendata.inrae.fr/PLP/863
related: http://opendata.inrae.fr/PLP/777
top concept of: PLP

RDF description of
primary topic: intergrade