interstratifié
type: Concept
subject: Pedology @en
subject: Pédologie
definition: Qualifie un histosol dans lequel de minces couches de matériaux minéraux sont intercalées quelle que soit leur épaisseur cumulée (Référentiel Pédologique 2007). (Source : INRA)
in scheme: PLP
preferred label: interstratified @en
top concept of: PLP

RDF description of
primary topic: interstratifié