intertextique
type: Concept
subject: Pedology @en
subject: Pédologie
definition: Désigne un mode d'arrangement des constituants les plus fins (plasma) et des grains du squelette (limons et sables), dans lequel ces derniers sont liés les uns aux autres par des ponts de matériaux plus fins (argiles ou matières organiques). (Source : INRA)
in scheme: PLP
note: Ce type d'assemblage génère des réseaux continus de vides assez gros. (Source : INRA)
preferred label: intertextic @en
top concept of: PLP

RDF description of
primary topic: intertextique