RDF description of
primary topic: jarosite

jarosite
type: Concept
subject: Pedology
subject: Pédologie @fr
definition: Sulfate basique de fer et de potassium, de couleur jaune-pâle et de formule KFe3 (SO4)2 (OH)6, qui se forme par oxydation de la pyrite dans les Thiosols et les Sulfatosols. (Source : INRA) @fr
in scheme: PLP
related: http://opendata.inrae.fr/PLP/969
related: http://opendata.inrae.fr/PLP/929
related: http://opendata.inrae.fr/PLP/593
top concept of: PLP