RDF description of
primary topic: juxtaposition de sols

juxtaposition de sols
type: Concept
subject: Pedology @en
subject: Pédologie
definition: Association, sur une carte, de différents types de sols dont chacun ne représente qu'une petite surface à l'échelle de cette carte et dont la coexistence ne paraît dépendre d'aucune règle de répartition reconnue. (Source : INRA)
in scheme: PLP
preferred label: juxtaposition of soils @en
related: http://opendata.inrae.fr/PLP/87
related: http://opendata.inrae.fr/PLP/992
top concept of: PLP