kaolinite
type: Concept
subject: Mineralogy @en
subject: Pedology @en
subject: Minéralogie
subject: Pédologie
definition: Type de minéraux argileux 1/1 alumineux, dioctaédriques et neutres, constitués d'édifices rigides à équidistance invariable entre les feuillets (7 angströms), ayant une très faible capacité d'échange cationique et une faible capacité de gonflement. (Source : INRA)
in scheme: PLP
note: La kaolinite se présente sous la forme de particules monocristallines (cristallites) dont les dimensions, en général importantes, varient largement en fonction de l'origine du minéral. C'est le minéral argileux de néogenèse des sols des zones intertropicales humides. Dans les sols français, elle est souvent héritée du matériau parental ou bien résulte de paléopédogenèses (argiles à silex, argiles à chailles). (Source : INRA)
related: http://opendata.inrae.fr/PLP/615
related: http://opendata.inrae.fr/PLP/625
related: http://opendata.inrae.fr/PLP/877
top concept of: PLP

RDF description of
primary topic: kaolinite