RDF description of
primary topic: analyse structurale des couvertures pédologiques

analyse structurale des couvertures pédologiques
type: Concept
subject: Pedology @en
subject: Pédologie
definition: Méthode d'analyse tridimensionnelle des couvertures pédologiques sur le terrain. (Source : INRA)
in scheme: PLP
note: Cette méthode a été mise au point au début des années 1980 par des pédologues de l'ORSTOM (devenu IRD) travaillant en Guyane française et en Afrique. (Source : INRA)
preferred label: structural analysis of soil mantles @en
related: http://opendata.inrae.fr/PLP/996
top concept of: PLP