lapiaz
type: Concept
subject: Géomorphologie
subject: Geomorphology @en
alternative label: solution rills @en
alternative label: grike @en
alternative label: lapiès
alternative label: lapies @en
alternative label: clint @en
alternative label: lapiez
definition: Roches calcaires ou dolomitiques, affleurant en surface et dépourvues de toute couverture pédologique, creusées de trous, cannelures ou rigoles, par dissolution des carbonates. (Source : INRA)
in scheme: PLP
note: Ces formations karstiques sont rares en plaine, mais plus courante dans les montagnes calcaires. Des formes identiques existent parfois en plaine, masquées sous des couvertures pédologiques plus ou moins épaisses (lapiaz couvert). (Source : INRA)
preferred label: karren @en
top concept of: PLP

RDF description of
primary topic: lapiaz