laquefilm
type: Concept
subject: Pedology @en
subject: Pédologie
alternative label: lacquer peel @en
definition: Méthode de prélèvement non destructive de solums, respectant pratiquement toutes leurs propriétés (couleurs, structure, épaisseur et succession des horizons, éléments grossiers) et permettant leur présentation en salle. (Source : INRA)
in scheme: PLP
note: Le prélèvement consiste d'abord en une imprégnation avec une résine spéciale (ou laque) d'une face bien préparée (nettoyée et lissée) d'une fosse pédologique sur laquelle est appliquée une toile. On laisse ensuite cette résine durcir à l'air pendant 24 heures, puis on procède à l'arrachage de la toile sur laquelle est désormais collée une certaine épaisseur de sol. (Source : INRA)
preferred label: peeling @en
related: http://opendata.inrae.fr/PLP/624
top concept of: PLP

RDF description of
primary topic: laquefilm