légende FAO
type: Concept
subject: Pedology @en
subject: Pédologie
definition: Légende d'une carte des sols du monde à 1/5 000 000 publiée en 1974 par la FAO-UNESCO et ayant servi de première classification mondiale acceptée internationalement. (Source : INRA)
in scheme: PLP
note: Révisée en 1988 (version anglaise) et en 1989 (version française), cette légende est en partie à l'origine de la Base de référence mondiale pour les ressources en sols (WRB). (Source : INRA)
preferred label: FAO legend @en
related: http://opendata.inrae.fr/PLP/98
top concept of: PLP

RDF description of
primary topic: légende FAO