RDF description of
primary topic: Leptismectisols

Leptismectisols
type: Concept
subject: Pedology @en
subject: Pédologie
definition: Solums peu épais, dont tous les horizons sont argileux, smectitiques et présentent des propriétés vertiques (Référentiel Pédologique). (Source : INRA)
in scheme: PLP
note: Le solum est souvent limité en profondeur soit par une roche dure et massive carbonatée ou non (couche R), soit par un encroûtement calcaire (horizon Kc ou Km). C'est pourquoi il n'existe pas en profondeur d'horizon V à structure sphénoïde. (Source : INRA)
related: http://opendata.inrae.fr/PLP/484
related: http://opendata.inrae.fr/PLP/462
related: http://opendata.inrae.fr/PLP/863
top concept of: PLP