RDF description of
primary topic: lessivage

lessivage
type: Concept
subject: Pedology @en
subject: Agronomie
subject: Pédologie
subject: Agronomy @en
definition: Entraînement par l'eau de percolation (ou autres liquides) de particules fines du sol (argiles) et de substances dissoutes (azote, potassium, bicarbonate de calcium, etc.). (Source : INRA)
in scheme: PLP
note: Sous nos climats, peut exister un lessivage vertical de particules argileuses (menant à la formation des luvisols) et un lessivage latéral ou oblique de ces mêmes particules (certains planosols). (Source : INRA)
preferred label: leaching @en
related: http://opendata.inrae.fr/PLP/198
related: http://opendata.inrae.fr/PLP/521
related: http://opendata.inrae.fr/PLP/322
related: http://opendata.inrae.fr/PLP/515
related: http://opendata.inrae.fr/PLP/568
top concept of: PLP