limite de plasticité
type: Concept
subject: Pedology @en
subject: Pédologie
definition: Quantité d'eau contenue dans un échantillon de sol en cours d'humectation progressif à un stade où on commence à pouvoir réaliser à la main un petit boudin de 3 mm de diamètre sans qu'il se fragmente. (Source : INRA)
in scheme: PLP
note: Le test mis au point par Atterberg, agronome suédois, consiste à humecter progressivement un échantillon de sol et à déterminer la teneur en eau à partir de laquelle on commence à pouvoir réaliser à la main un petit boudin de 3 mm de diamètre sans qu'il se fragmente. (Source : INRA)
preferred label: plasticity limit @en
related: http://opendata.inrae.fr/PLP/517
related: http://opendata.inrae.fr/PLP/552
top concept of: PLP

RDF description of
primary topic: limite de plasticité