limites entre les horizons
type: Concept
subject: Pedology @en
subject: Pédologie
definition: Séparations virtuelles que l'on décide de définir lorsqu'on découpe un solum en horizons. (Source : INRA)
in scheme: PLP
note: Dans une fosse, ces limites sont plus ou moins sinueuses et plus ou moins nettes. On doit donc décrire à la fois leur netteté et leurs formes. La netteté dépend à la fois du contraste entre les deux horizons et de la transition plus ou moins rapide : une transition graduelle peut accompagner un contraste fort et une limite nette séparer deux horizons peu contrastés. Une limite est donc d'autant plus difficile à localiser et à définir que la transition est graduelle. Dans l'espace, ce sont des surfaces virtuelles courbes. (Source : INRA)
preferred label: horizon boundaries @en
related: http://opendata.inrae.fr/PLP/648
related: http://opendata.inrae.fr/PLP/169
related: http://opendata.inrae.fr/PLP/456
related: http://opendata.inrae.fr/PLP/415
top concept of: PLP

RDF description of
primary topic: limites entre les horizons