lithochrome
type: Concept
subject: Pedology @en
subject: Pédologie
definition: Qualifie un horizon ou un solum dont la couleur prononcée (rouge, verte, noirâtre) est principalement un héritage du matériau parental et ne résulte pas de processus pédogénétiques. (Source : INRA)
in scheme: PLP
preferred label: lithochromic @en
top concept of: PLP

RDF description of
primary topic: lithochrome