lithomorphe
type: Concept
subject: Pedology @en
subject: Pédologie
definition: Qualifie un vertisol dont l'existence résulte essentiellement d'un héritage du matériau parental, constitué surtout de smectites et à drainage externe possible. (Source : INRA)
in scheme: PLP
preferred label: lithomorphic @en
related: http://opendata.inrae.fr/PLP/1001
related: http://opendata.inrae.fr/PLP/564
related: http://opendata.inrae.fr/PLP/863
top concept of: PLP

RDF description of
primary topic: lithomorphe