lithoreliques
type: Concept
subject: Pedology @en
subject: Pédologie
definition: Traits pédologiques constitués de petits débris de roches altérées de la taille des graviers ou plus petits. (Source : INRA)
in scheme: PLP
note: C'est seulement sur lames minces qu'elles sont reconnaissables grâce à leur organisation interne. (Source : INRA)
preferred label: lithorelicts @en
top concept of: PLP

RDF description of
primary topic: lithoreliques