litière
type: Concept
subject: Pedology @en
subject: Agronomie
subject: Pédologie
subject: Agronomy @en
alternative label: horizon OL
definition: Débris végétaux (feuilles, aiguilles, brindilles) non ou peu transformés, s'accumulant à la surface des sols forestiers. (Source : INRA)
in scheme: PLP
preferred label: litter @en
related: http://opendata.inrae.fr/PLP/472
related: http://opendata.inrae.fr/PLP/894
top concept of: PLP

RDF description of
primary topic: litière