RDF description of
primary topic: lixisols

lixisols
type: Concept
subject: Pedology @en
subject: Pédologie
definition: Groupes de sols de référence caractérisés par une accumulation d'argile dans un horizon B argique ainsi que par des minéraux argileux à faible activité et un taux de saturation modéré à élevé, d'où une structure mieux développée que dans le cas des Acrisols (WRB). (Source : INRA)
in scheme: PLP
note: Un horizon éluvial massif est souvent présent. Ces sols sont observés sous climats tropicaux, subtropicaux et tempérés chauds à saison sèche marquée. (Source : INRA)
top concept of: PLP