loam
type: Concept
subject: Pedology @en
subject: Pédologie
definition: Matériau de granulométrie limono-argileuse et, dans certains triangles de texture, classe granulométrique limono-argileuse. (Source : INRA)
in scheme: PLP
note: Anglicisme, rarement employé en français. Dans le deuxième sens, il s'oppose à silt. (Source : INRA)
related: http://opendata.inrae.fr/PLP/570
top concept of: PLP

RDF description of
primary topic: loam