lœss
type: Concept
subject: Geology @en
subject: Pedology @en
subject: Géologie
subject: Pédologie
alternative label: lehm
definition: Formations superficielles éoliennes de granulométrie essentiellement limoneuse, formées au Quaternaire sous climats périglaciaires. (Source : INRA)
in scheme: PLP
note: D'origine lointaine ou relativement proche, les lœss tapissent sur des épaisseurs variant de 1 à 10 m aussi bien les plateaux (Picardie, Vexin, Haute Normandie) que des versants ou des terrasses alluviales. En Europe occidentale, les lœss sont faiblement calcaires (10 à 15 %) et plus ou moins sableux. La partie supérieure décarbonatée des lœss était autrefois nommée " lehm " (terme à éviter). Leur décarbonatation rapide sous nos climats donne un matériau limoneux et poreux, particulièrement favorable au processus d'illuviation d'argile et au développement de Néoluvisols et Luvisols Typiques très fertiles. (Source : INRA)
preferred label: loess @en
top concept of: PLP

RDF description of
primary topic: lœss