lœssoïde
type: Concept
subject: Pedology @en
subject: Pédologie
definition: Qualifie des matériaux d'origine périglaciaire qui ressemblent plus ou moins aux lœss typiques mais qui sont souvent nettement plus argileux. (Source : INRA)
in scheme: PLP
note: Ces matériaux sont observés fréquemment en Europe de l'Est. (Source : INRA)
preferred label: loess-like @en
top concept of: PLP

RDF description of
primary topic: lœssoïde