lutum
type: Concept
subject: Pedology @en
subject: Pédologie
modified: 2020-08-27T15:10:18.760+02:00
alternative label: fraction granulométrique argiles
definition: Ensemble des particules de dimension inférieure à 2 micromètres. (Source : INRA)
in scheme: PLP
note: Mot d'origine latine, utilisé par les pédologues néerlandais, permettant d'éviter toute ambiguité avec le mot « argiles ». (Source : INRA)
top concept of: PLP

RDF description of
primary topic: lutum