luvique
type: Concept
subject: Pedology @en
subject: Pédologie
definition: Qualifie un solum présentant des traits d'illuviation d'argile dans un horizon, insuffisants cependant pour que cet horizon soit considéré comme un véritable horizon BT (Référentiel Pédologique). (Source : INRA)
in scheme: PLP
note: Exemples : Brunisol Mésosaturé luvique, Arénosol luvique, etc. (Source : INRA)
preferred label: luvic @en
top concept of: PLP

RDF description of
primary topic: luvique