macroéléments
type: Concept
subject: Physiologie végétale
subject: Plant physiology @en
definition: Éléments chimiques entrant dans la composition des végétaux avec des concentrations comprises entre quelques pour mille et quelques pour cent de matière sèche. (Source : INRA)
in scheme: PLP
note: Exemples : l'azote, le soufre, le phosphore, le calcium. (Source : INRA)
preferred label: macronutrients @en
related: http://opendata.inrae.fr/PLP/656
related: http://opendata.inrae.fr/PLP/317
top concept of: PLP

RDF description of
primary topic: macroéléments