magnésium
type: Concept
subject: Geology @en
subject: Pedology @en
subject: Géologie
subject: Pédologie
alternative label: Mg
definition: Élément chimique majeur de la croûte terrestre (2,2 % environ) présent dans certains silicates (dits ferromagnésiens) ainsi que dans la dolomite. (Source : INRA)
in scheme: PLP
note: Elément indispensable à la vie des plantes, il joue un rôle important dans de nombreux métabolismes, notamment il est nécessaire au maintien de l'intégrité des chloroplastes et mitochondries. En paysage calcaire, une abondance relative de cet élément dans un sol peut être la marque de la présence de dolomie. Dans le domaine des roches magmatiques plutoniques et des roches métamorphiques, le magnésium provient des minéraux ferromagnésiens (biotites, amphiboles, pyroxènes, péridots) et de leurs altérations (chlorites). Dans les sols, les teneurs totales en Mg sont généralement inférieures à 0,8 %, mais elles atteignent 1 à 4 % dans certains cas particuliers (sols dolomitiques, sols issus de gneiss à biotites, d'amphi-bolites ou de serpentinites). L'abondance de Mg dans les fractions granulométriques inférieures à 2 ou 5 µm, peut signifier la présence de glauconite, de chlorites, de vermiculites ou de smectites dioctaédriques. (Source : INRA)
preferred label: magnesium @en
related: http://opendata.inrae.fr/PLP/371
related: http://opendata.inrae.fr/PLP/281
top concept of: PLP

RDF description of
primary topic: magnésium