RDF description of
primary topic: mangrove

mangrove
type: Concept
subject: Pedology @en
subject: Ecology @en
subject: Pédologie
subject: Écologie
definition: Association végétale halophile constituée principalement de palétuviers et localisée aux rivages plats et vaseux, non battus par la houle, et aux estuaires à eaux saumâtres des régions tropicales. (Source : INRA)
in scheme: PLP
note: Ces vases sont à la fois riches en chlorures et en matières organiques mais aussi en soufre, présent sous forme de sulfures. (Source : INRA)
related: http://opendata.inrae.fr/PLP/969
related: http://opendata.inrae.fr/PLP/929
related: http://opendata.inrae.fr/PLP/883
related: http://opendata.inrae.fr/PLP/889
top concept of: PLP