matériau parental
type: Concept
subject: Pedology @en
subject: Pédologie
alternative label: matériau originel
definition: Roche, au sens le plus large incluant toutes les formations superficielles, située aujourd'hui sous les horizons pédologiques et à partir de laquelle ces horizons se sont développés. (Source : INRA)
in scheme: PLP
note: Le vrai matériau parental des horizons pédologiques supérieurs n'existe plus puisqu'il est transformé en sol. Le matériau parental que l'on observe aujourd'hui peut être un peu, voire très différent de celui qui a disparu. On pourrait aussi employer le terme " matériau parent ". (Source : INRA)
preferred label: parent material @en
related: http://opendata.inrae.fr/PLP/926
related: http://opendata.inrae.fr/PLP/927
related: http://opendata.inrae.fr/PLP/441
related: http://opendata.inrae.fr/PLP/387
related: http://opendata.inrae.fr/PLP/820
top concept of: PLP

RDF description of
primary topic: matériau parental